Target
Delta-type opioid receptor
Ligand
BDBM50059367
Substrate
Meas. Tech.
ChEMBL_146898 (CHEMBL751672)
Ki
0.2±n/a nM
Citation
 Bryant, SDGuerrini, RSalvadori, SBianchi, CTomatis, RAttila, MLazarus, LH Helix-inducing alpha-aminoisobutyric acid in opioid mimetic deltorphin C analogues. J Med Chem 40:2579-87 (1997)  
Target
Name:
Delta-type opioid receptor
Synonyms:
Cytochrome P450 3A4 Delta opioid receptor Delta-type opioid receptor (DOR) OPRD_RAT Opioid receptor Opioid receptors; mu & delta Ror-a | Voltage-gated potassium channel
Type:
G Protein-Coupled Receptor (GPCR)
Mol. Mass.:
40465.04
Organism:
Rattus norvegicus (rat)
Description:
Competition binding assays were using CHO-K1 cell membranes expressing the opioid receptor.
Residue:
372
  
Inhibitor
Name:
BDBM50059367
Synonyms:
(S)-2-[2-((S)-2-{(R)-2-[(S)-2-Amino-3-(4-hydroxy-phenyl)-propionylamino]-propionylamino}-3-phenyl-propionylamino)-2-methyl-propionylamino]-N-[(S)-1-(carbamoylmethyl-carbamoyl)-2-methyl-propyl]-3-methyl-butyramide | CHEMBL420606
Type:
Small organic molecule
Emp. Form.:
C37H54N8O8
Mol. Mass.:
738.8735
SMILES:
CC(C)[C@H](NC(=O)[C@@H](NC(=O)C(C)(C)NC(=O)[C@H](Cc1ccccc1)NC(=O)[C@@H](C)NC(=O)[C@@H](N)Cc1ccc(O)cc1)C(C)C)C(=O)NCC(N)=O
: