Target
Adenosine receptor A1
Ligand
BDBM85776
Substrate
Meas. Tech.
ChEMBL_29470 (CHEMBL642199)
Ki
40100.0±n/a nM
Citation
 Jiang, Jvan Rhee, AMChang, LPatchornik, AJi, XDEvans, PMelman, NJacobson, KA Structure-activity relationships of 4-(phenylethynyl)-6-phenyl-1,4-dihydropyridines as highly selective A3 adenosine receptor antagonists. J Med Chem 40:2596-608 (1997)  
Target
Name:
Adenosine receptor A1
Synonyms:
AA1R_RAT ADENOSINE A1 high Adenosine A1 receptor (A1) Adenosine receptors A1 | Adora1
Type:
Protein
Mol. Mass.:
36704.13
Organism:
Rattus norvegicus (rat)
Description:
Residue:
326
  
Inhibitor
Name:
BDBM85776
Synonyms:
CAS_393594 MRS1191 | NSC_393594
Type:
Small organic molecule
Emp. Form.:
C31H27NO4
Mol. Mass.:
477.5504
SMILES:
CCOC(=O)C1C(C#Cc2ccccc2)C(C(=O)OCc2ccccc2)=C(N=C1C)c1ccccc1
: