Target
Acetylcholinesterase
Ligand
BDBM50059903
Substrate
Meas. Tech.
ChEMBL_27826 (CHEMBL636715)
Ki
1000±n/a nM
Citation
 Boyle, NATalesa, VGiovannini, ERosi, GNorton, SJ Synthesis and study of thiocarbonate derivatives of choline as potential inhibitors of acetylcholinesterase. J Med Chem 40:3009-13 (1997)  
Target
Name:
Acetylcholinesterase
Synonyms:
ACES_BOVIN Acetylcholinesterase (AChE) | Acetylcholinesterase precursor
Type:
Enzyme
Mol. Mass.:
67659.62
Organism:
Bos taurus (bovine)
Description:
Residue:
613
  
Inhibitor
Name:
BDBM50059903
Synonyms:
CHEMBL103873 | Trimethyl-(2-pentylsulfanylcarbonyloxy-ethyl)-ammonium; chloride
Type:
Small organic molecule
Emp. Form.:
C11H24NO2S
Mol. Mass.:
234.378
SMILES:
CCCCCSC(=O)OCC[N+](C)(C)C
: