Target
Histone deacetylase 6
Ligand
BDBM50507695
Substrate
Meas. Tech.
ChEMBL_1831287 (CHEMBL4331295)
Ki
2.1±n/a nM
Citation
 Yu, CWHung, PYYang, HTHo, YHLai, HYCheng, YSChern, JW Quinazolin-2,4-dione-Based Hydroxamic Acids as Selective Histone Deacetylase-6 Inhibitors for Treatment of Non-Small Cell Lung Cancer. J Med Chem 62:857-874 (2019)  
Target
Name:
Histone deacetylase 6
Synonyms:
Cereblon/Histone deacetylase 6 HDAC6 Histone deacetylase 6 (HDAC6) KIAA0901 | ORF Names:JM21
Type:
Chromatin regulator; hydrolase; repressor
Mol. Mass.:
131381.51
Organism:
Homo sapiens (Human)
Description:
Q9UBN7
Residue:
1215
  
Inhibitor
Name:
BDBM50507695
Synonyms:
CHEMBL4554270 | US11535598, Compound 15
Type:
Small organic molecule
Emp. Form.:
C25H23N3O5
Mol. Mass.:
445.4672
SMILES:
COc1ccccc1CCn1c(=O)n(Cc2ccc(cc2)C(=O)NO)c2ccccc2c1=O
: