Target
Thromboxane A2 receptor
Ligand
BDBM50060445
Substrate
Meas. Tech.
ChEMBL_207644 (CHEMBL811626)
IC50
44±n/a nM
Citation
 Tsuri, THonma, THiramatsu, YOkada, THashizume, HMitsumori, SInagaki, MArimura, AYasui, KAsanuma, FKishino, JOhtani, M Bicyclo[2.2.1]heptane and 6,6-dimethylbicyclo[3.1.1]heptane derivatives: orally active, potent, and selective prostaglandin D2 receptor antagonists. J Med Chem 40:3504-7 (1997)  
Target
Name:
Thromboxane A2 receptor
Synonyms:
Prostanoid TP receptor TBXA2R Thromboxane Thromboxane Beta
Type:
Enyzme
Mol. Mass.:
37445.28
Organism:
Homo sapiens (Human)
Description:
P21731
Residue:
343
  
Inhibitor
Name:
BDBM50060445
Synonyms:
(Z)-7-[(1R,2S,3S,4S)-3-(Biphenyl-4-sulfonylamino)-bicyclo[2.2.1]hept-2-yl]-hept-5-enoic acid methyl ester | CHEMBL325026
Type:
Small organic molecule
Emp. Form.:
C27H33NO4S
Mol. Mass.:
467.62
SMILES:
COC(=O)CCC\C=C/C[C@H]1[C@@H]2CC[C@@H](C2)[C@@H]1NS(=O)(=O)c1ccc(cc1)-c1ccccc1
: