Target
Thromboxane A2 receptor
Ligand
BDBM50060453
Substrate
Meas. Tech.
ChEMBL_207644 (CHEMBL811626)
IC50
410±n/a nM
Citation
 Tsuri, THonma, THiramatsu, YOkada, THashizume, HMitsumori, SInagaki, MArimura, AYasui, KAsanuma, FKishino, JOhtani, M Bicyclo[2.2.1]heptane and 6,6-dimethylbicyclo[3.1.1]heptane derivatives: orally active, potent, and selective prostaglandin D2 receptor antagonists. J Med Chem 40:3504-7 (1997)  
Target
Name:
Thromboxane A2 receptor
Synonyms:
Prostanoid TP receptor TBXA2R Thromboxane Thromboxane Beta
Type:
Enyzme
Mol. Mass.:
37445.28
Organism:
Homo sapiens (Human)
Description:
P21731
Residue:
343
  
Inhibitor
Name:
BDBM50060453
Synonyms:
(Z)-7-{(1R,2R,3S,5S)-2-[(6-Hydroxy-benzo[b]thiophene-3-carbonyl)-amino]-6,6-dimethyl-bicyclo[3.1.1]hept-3-yl}-hept-5-enoic acid | CHEMBL119810
Type:
Small organic molecule
Emp. Form.:
C25H31NO4S
Mol. Mass.:
441.583
SMILES:
CC1(C)[C@@H]2C[C@H]1[C@H](NC(=O)c1csc3cc(O)ccc13)[C@@H](C\C=C/CCCC(O)=O)C2
: