Target
Prostaglandin D2 receptor
Ligand
BDBM50060467
Substrate
Meas. Tech.
ChEMBL_157791 (CHEMBL767849)
IC50
32±n/a nM
Citation
 Tsuri, THonma, THiramatsu, YOkada, THashizume, HMitsumori, SInagaki, MArimura, AYasui, KAsanuma, FKishino, JOhtani, M Bicyclo[2.2.1]heptane and 6,6-dimethylbicyclo[3.1.1]heptane derivatives: orally active, potent, and selective prostaglandin D2 receptor antagonists. J Med Chem 40:3504-7 (1997)  
Target
Name:
Prostaglandin D2 receptor
Synonyms:
PD2R_HUMAN Prostaglandin D2 Prostanoid DP receptor
Type:
Enzyme
Mol. Mass.:
40288.87
Organism:
Homo sapiens (Human)
Description:
Q13258
Residue:
359
  
Inhibitor
Name:
BDBM50060467
Synonyms:
(Z)-7-{(1R,2R,3S,5S)-2-[(Dibenzofuran-2-carbonyl)-amino]-6,6-dimethyl-bicyclo[3.1.1]hept-3-yl}-hept-5-enoic acid | CHEMBL119550
Type:
Small organic molecule
Emp. Form.:
C29H33NO4
Mol. Mass.:
459.5766
SMILES:
CC1(C)[C@@H]2C[C@H]1[C@H](NC(=O)c1ccc3oc4ccccc4c3c1)[C@@H](C\C=C/CCCC(O)=O)C2
: