Target
Carbonic anhydrase 7
Ligand
BDBM50507824
Substrate
Meas. Tech.
ChEMBL_1831754 (CHEMBL4331762)
Ki
0.450000±n/a nM
Citation
 Buemi, MRDi Fiore, ADe Luca, LAngeli, AMancuso, FFerro, SMonti, SMBuonanno, MRusso, EDe Sarro, GDe Simone, GSupuran, CTGitto, R Exploring structural properties of potent human carbonic anhydrase inhibitors bearing a 4-(cycloalkylamino-1-carbonyl)benzenesulfonamide moiety. Eur J Med Chem 163:443-452 (2019)  
Target
Name:
Carbonic anhydrase 7
Synonyms:
CA-VII CAH7_HUMAN Carbonic anhydrase Carbonic anhydrase VII (CA VII)
Type:
Enzyme
Mol. Mass.:
29664.11
Organism:
Homo sapiens (Human)
Description:
Human cloned isozyme.
Residue:
264
  
Inhibitor
Name:
BDBM50507824
Synonyms:
CHEMBL4437968
Type:
Small organic molecule
Emp. Form.:
C18H20N2O3S
Mol. Mass.:
344.428
SMILES:
NS(=O)(=O)c1ccc(cc1)C(=O)N1CCC(CC1)c1ccccc1
: