Target
D(4) dopamine receptor
Ligand
BDBM50061330
Substrate
Meas. Tech.
ChEMBL_60661 (CHEMBL671698)
Ki
0.84±n/a nM
Citation
 Unangst, PCCapiris, TConnor, DTDoubleday, RHeffner, TGMacKenzie, RGMiller, SRPugsley, TAWise, LD (Aryloxy)alkylamines as selective human dopamine D4 receptor antagonists: potential antipsychotic agents. J Med Chem 40:4026-9 (1998)  
Target
Name:
D(4) dopamine receptor
Synonyms:
D(2C) dopamine receptor DOPAMINE D4.2 DRD4 Dopamine D4 receptor
Type:
Enzyme
Mol. Mass.:
48373.19
Organism:
Homo sapiens (Human)
Description:
P21917
Residue:
419
  
Inhibitor
Name:
BDBM50061330
Synonyms:
CHEMBL129757 | [2-(4-Chloro-phenoxy)-ethyl]-[3-(4-fluoro-phenoxy)-propyl]-amine
Type:
Small organic molecule
Emp. Form.:
C17H19ClFNO2
Mol. Mass.:
323.79
SMILES:
Fc1ccc(OCCCNCCOc2ccc(Cl)cc2)cc1
: