Target
D(4) dopamine receptor
Ligand
BDBM50061334
Substrate
Meas. Tech.
ChEMBL_60661 (CHEMBL671698)
Ki
0.52±n/a nM
Citation
 Unangst, PCCapiris, TConnor, DTDoubleday, RHeffner, TGMacKenzie, RGMiller, SRPugsley, TAWise, LD (Aryloxy)alkylamines as selective human dopamine D4 receptor antagonists: potential antipsychotic agents. J Med Chem 40:4026-9 (1998)  
Target
Name:
D(4) dopamine receptor
Synonyms:
D(2C) dopamine receptor DOPAMINE D4.2 DRD4 Dopamine D4 receptor
Type:
Enzyme
Mol. Mass.:
48373.19
Organism:
Homo sapiens (Human)
Description:
P21917
Residue:
419
  
Inhibitor
Name:
BDBM50061334
Synonyms:
CHEMBL131997 | [2-(3-Chloro-4-methyl-phenoxy)-ethyl]-(3-phenoxy-propyl)-amine
Type:
Small organic molecule
Emp. Form.:
C18H22ClNO2
Mol. Mass.:
319.826
SMILES:
Cc1ccc(OCCNCCCOc2ccccc2)cc1Cl
: