Target
Platelet-activating factor receptor
Ligand
BDBM50062106
Substrate
Meas. Tech.
ChEMBL_158347 (CHEMBL768491)
Ki
0.900000±n/a nM
Citation
 Curtin, MLDavidsen, SKHeyman, HRGarland, RBSheppard, GSFlorjancic, ASXu, LCarrera, GMSteinman, DHTrautmann, JAAlbert, DHMagoc, TJTapang, PRhein, DAConway, RGLuo, GDenissen, JFMarsh, KCMorgan, DWSummers, JB Discovery and evaluation of a series of 3-acylindole imidazopyridine platelet-activating factor antagonists. J Med Chem 41:74-95 (1998)  
Target
Name:
Platelet-activating factor receptor
Synonyms:
PAF-R PTAFR_CAVPO Platelet-activating factor receptor
Type:
Protein
Mol. Mass.:
39005.63
Organism:
Cavia porcellus
Description:
Residue:
342
  
Inhibitor
Name:
BDBM50062106
Synonyms:
4-Chloro-3-[4-(2-methyl-imidazo[4,5-b]pyridin-1-ylmethyl)-benzoyl]-indole-1-carboxylic acid dimethylamide | CHEMBL173584
Type:
Small organic molecule
Emp. Form.:
C26H22ClN5O2
Mol. Mass.:
471.938
SMILES:
CN(C)C(=O)n1cc(C(=O)c2ccc(Cn3c(C)nc4ncccc34)cc2)c2c(Cl)cccc12
: