Target
Platelet-activating factor receptor
Ligand
BDBM50062066
Substrate
Meas. Tech.
ChEMBL_158347 (CHEMBL768491)
Ki
0.190000±n/a nM
Citation
 Curtin, MLDavidsen, SKHeyman, HRGarland, RBSheppard, GSFlorjancic, ASXu, LCarrera, GMSteinman, DHTrautmann, JAAlbert, DHMagoc, TJTapang, PRhein, DAConway, RGLuo, GDenissen, JFMarsh, KCMorgan, DWSummers, JB Discovery and evaluation of a series of 3-acylindole imidazopyridine platelet-activating factor antagonists. J Med Chem 41:74-95 (1998)  
Target
Name:
Platelet-activating factor receptor
Synonyms:
PAF-R PTAFR_CAVPO Platelet-activating factor receptor
Type:
Protein
Mol. Mass.:
39005.63
Organism:
Cavia porcellus
Description:
Residue:
342
  
Inhibitor
Name:
BDBM50062066
Synonyms:
3-[4-(2-Methyl-imidazo[4,5-c]pyridin-1-ylmethyl)-benzoyl]-1-(propane-2-sulfonyl)-1H-indole-4-carboxylic acid methyl ester | CHEMBL368113
Type:
Small organic molecule
Emp. Form.:
C28H26N4O5S
Mol. Mass.:
530.595
SMILES:
COC(=O)c1cccc2n(cc(C(=O)c3ccc(Cn4c(C)nc5cnccc45)cc3)c12)S(=O)(=O)C(C)C
: