Target
Platelet-activating factor receptor
Ligand
BDBM50062092
Substrate
Meas. Tech.
ChEMBL_158347 (CHEMBL768491)
Ki
0.870000±n/a nM
Citation
 Curtin, MLDavidsen, SKHeyman, HRGarland, RBSheppard, GSFlorjancic, ASXu, LCarrera, GMSteinman, DHTrautmann, JAAlbert, DHMagoc, TJTapang, PRhein, DAConway, RGLuo, GDenissen, JFMarsh, KCMorgan, DWSummers, JB Discovery and evaluation of a series of 3-acylindole imidazopyridine platelet-activating factor antagonists. J Med Chem 41:74-95 (1998)  
Target
Name:
Platelet-activating factor receptor
Synonyms:
PAF-R PTAFR_CAVPO Platelet-activating factor receptor
Type:
Protein
Mol. Mass.:
39005.63
Organism:
Cavia porcellus
Description:
Residue:
342
  
Inhibitor
Name:
BDBM50062092
Synonyms:
(4,7-Dimethyl-1H-indol-3-yl)-[4-(2-methyl-imidazo[4,5-c]pyridin-1-ylmethyl)-phenyl]-methanone | CHEMBL176797
Type:
Small organic molecule
Emp. Form.:
C25H22N4O
Mol. Mass.:
394.4684
SMILES:
Cc1nc2cnccc2n1Cc1ccc(cc1)C(=O)c1c[nH]c2c(C)ccc(C)c12
: