Target
Platelet-activating factor receptor
Ligand
BDBM50062054
Substrate
Meas. Tech.
ChEMBL_158347 (CHEMBL768491)
Ki
1±n/a nM
Citation
 Curtin, MLDavidsen, SKHeyman, HRGarland, RBSheppard, GSFlorjancic, ASXu, LCarrera, GMSteinman, DHTrautmann, JAAlbert, DHMagoc, TJTapang, PRhein, DAConway, RGLuo, GDenissen, JFMarsh, KCMorgan, DWSummers, JB Discovery and evaluation of a series of 3-acylindole imidazopyridine platelet-activating factor antagonists. J Med Chem 41:74-95 (1998)  
Target
Name:
Platelet-activating factor receptor
Synonyms:
PAF-R PTAFR_CAVPO Platelet-activating factor receptor
Type:
Protein
Mol. Mass.:
39005.63
Organism:
Cavia porcellus
Description:
Residue:
342
  
Inhibitor
Name:
BDBM50062054
Synonyms:
4-Ethynyl-3-[3-fluoro-4-(2-methyl-imidazo[4,5-c]pyridin-1-ylmethyl)-benzoyl]-indole-1-carboxylic acid dimethylamide | CHEMBL369225
Type:
Small organic molecule
Emp. Form.:
C28H22FN5O2
Mol. Mass.:
479.505
SMILES:
CN(C)C(=O)n1cc(C(=O)c2ccc(Cn3c(C)nc4cnccc34)c(F)c2)c2c(cccc12)C#C
: