Target
Trypanothione reductase
Ligand
BDBM50062261
Substrate
Meas. Tech.
ChEMBL_211973 (CHEMBL817703)
Ki
127000±n/a nM
Citation
 Chan, CYin, HGarforth, JMcKie, JHJaouhari, RSpeers, PDouglas, KTRock, PJYardley, VCroft, SLFairlamb, AH Phenothiazine inhibitors of trypanothione reductase as potential antitrypanosomal and antileishmanial drugs. J Med Chem 41:148-56 (1998)  
Target
Name:
Trypanothione reductase
Synonyms:
N(1),N(8)-bis(glutathionyl)spermidine reductase TR | TYTR_TRYCR
Type:
Homodimer; oxidoreductase
Mol. Mass.:
53868.26
Organism:
Trypanosoma cruzi
Description:
Residue:
492
  
Inhibitor
Name:
BDBM50062261
Synonyms:
CHEMBL829 Methylpromazine TRIMEPRAZINE | Temaril
Type:
Small organic molecule
Emp. Form.:
C18H22N2S
Mol. Mass.:
298.446
SMILES:
CC(CN(C)C)CN1c2ccccc2Sc2ccccc12
: