Target
Casein kinase II subunit alpha
Ligand
BDBM50335638
Substrate
Meas. Tech.
ChEMBL_1836630 (CHEMBL4336763)
Ki
0.380000±n/a nM
Citation
 Qiao, YChen, TYang, HChen, YLin, HQu, WFeng, FLiu, WGuo, QLiu, ZSun, H Small molecule modulators targeting protein kinase CK1 and CK2. Eur J Med Chem 181:0 (2019)  
Target
Name:
Casein kinase II subunit alpha
Synonyms:
CK II CK2- alpha CSK21_HUMAN Casein kinase 2 Casein kinase II alpha/beta Casein kinase II subunit alpha (CK2A1) Casein kinase II subunit alpha (CK2a V66A) Casein kinase II subunit alpha (CK2a)
Type:
Enzyme
Mol. Mass.:
45151.12
Organism:
Homo sapiens (Human)
Description:
P68400
Residue:
391
  
Inhibitor
Name:
BDBM50335638
Synonyms:
5-(3-Chlorophenylamino)benzo[c][2,6]naphthyridine-8-carboxylic acid CHEMBL1230165 US9062043, Table 13, Compound 17 | US9062043, Table 20b, Compound 12
Type:
Small organic molecule
Emp. Form.:
C19H12ClN3O2
Mol. Mass.:
349.77
SMILES:
OC(=O)c1ccc2c(c1)nc(Nc1cccc(Cl)c1)c1ccncc21
: