Target
Fucose-binding lectin PA-IIL
Ligand
BDBM50166886
Substrate
Meas. Tech.
ChEMBL_1837233 (CHEMBL4337366)
IC50
157000±n/a nM
Citation
 Taouai, MChakroun, KSommer, RMichaud, GGiacalone, DBen Maaouia, MAVallin-Butruille, AMathiron, DAbidi, RDarbre, TCragg, PJMullié, CReymond, JLO'Toole, GABenazza, M Glycocluster Tetrahydroxamic Acids Exhibiting Unprecedented Inhibition of  J Med Chem 62:7722-7738 (2019)  
Target
Name:
Fucose-binding lectin PA-IIL
Synonyms:
LecB | PA-IIL
Type:
Protein
Mol. Mass.:
11857.84
Organism:
Pseudomonas aeruginosa
Description:
Q9HYN5
Residue:
115
  
Inhibitor
Name:
BDBM50166886
Synonyms:
CHEMBL195368 | methyl alpha-D-mannoside
Type:
Small organic molecule
Emp. Form.:
C7H14O6
Mol. Mass.:
194.1825
SMILES:
CO[C@H]1O[C@H](CO)[C@@H](O)[C@H](O)[C@@H]1O
: