Target
DNA ligase 1
Ligand
BDBM50509108
Substrate
Meas. Tech.
ChEMBL_1837502 (CHEMBL4337635)
IC50
15470±n/a nM
Citation
 Saquib, MAnsari, MIJohnson, CRKhatoon, SKamil Hussain, MCoop, A Recent advances in the targeting of human DNA ligase I as a potential new strategy for cancer treatment. Eur J Med Chem 182:0 (2019)  
Target
Name:
DNA ligase 1
Synonyms:
ATP-dependent DNA ligase DNLI1_HUMAN LIG1 | Polydeoxyribonucleotide synthase [ATP]
Type:
Enzyme
Mol. Mass.:
101721.76
Organism:
Homo sapiens (Human)
Description:
Residue:
919
  
Inhibitor
Name:
BDBM50509108
Synonyms:
CHEMBL4440472
Type:
Small organic molecule
Emp. Form.:
C18H10BrCl2N5O2
Mol. Mass.:
479.114
SMILES:
Clc1ccc(cc1)N1C(=O)\C(=N/Nc2cn[nH]c(=O)c2Cl)c2cc(Br)ccc12
: