Target
DNA ligase 1
Ligand
BDBM50509109
Substrate
Meas. Tech.
ChEMBL_1837480 (CHEMBL4337613)
IC50
10000±n/a nM
Citation
 Saquib, MAnsari, MIJohnson, CRKhatoon, SKamil Hussain, MCoop, A Recent advances in the targeting of human DNA ligase I as a potential new strategy for cancer treatment. Eur J Med Chem 182:0 (2019)  
Target
Name:
DNA ligase 1
Synonyms:
ATP-dependent DNA ligase DNLI1_HUMAN LIG1 | Polydeoxyribonucleotide synthase [ATP]
Type:
Enzyme
Mol. Mass.:
101721.76
Organism:
Homo sapiens (Human)
Description:
Residue:
919
  
Inhibitor
Name:
BDBM50509109
Synonyms:
CHEMBL4461698
Type:
Small organic molecule
Emp. Form.:
C16H14Br2N4O4
Mol. Mass.:
486.115
SMILES:
Cc1c(Br)cc(NCC(=O)N\N=C\c2cc(ccc2O)[N+]([O-])=O)cc1Br
: