Target
DNA ligase 1
Ligand
BDBM50346601
Substrate
Meas. Tech.
ChEMBL_1837505 (CHEMBL4337638)
IC50
186000±n/a nM
Citation
 Saquib, MAnsari, MIJohnson, CRKhatoon, SKamil Hussain, MCoop, A Recent advances in the targeting of human DNA ligase I as a potential new strategy for cancer treatment. Eur J Med Chem 182:0 (2019)  
Target
Name:
DNA ligase 1
Synonyms:
ATP-dependent DNA ligase DNLI1_HUMAN LIG1 | Polydeoxyribonucleotide synthase [ATP]
Type:
Enzyme
Mol. Mass.:
101721.76
Organism:
Homo sapiens (Human)
Description:
Residue:
919
  
Inhibitor
Name:
BDBM50346601
Synonyms:
NSC-114945 Oleanolic acid US11660306, Example Oleanolic acid
Type:
Small organic molecule
Emp. Form.:
C30H48O3
Mol. Mass.:
456.7003
SMILES:
CC1(C)CC[C@@]2(CC[C@]3(C)C(=CC[C@@H]4[C@@]5(C)CC[C@H](O)C(C)(C)[C@@H]5CC[C@@]34C)[C@@H]2C1)C(O)=O
: