Target
Lanosterol synthase
Ligand
BDBM50062849
Substrate
Meas. Tech.
ChEMBL_148890 (CHEMBL758671)
IC50
1500±n/a nM
Citation
 Ceruti, MRocco, FViola, FBalliano, GMilla, PArpicco, SCattel, L 29-Methylidene-2,3-oxidosqualene derivatives as stereospecific mechanism-based inhibitors of liver and yeast oxidosqualene cyclase. J Med Chem 41:540-54 (1998)  
Target
Name:
Lanosterol synthase
Synonyms:
2,3-epoxysqualene--lanosterol cyclase LSS_HUMAN Oxidosqualene--lanosterol cyclase
Type:
PROTEIN
Mol. Mass.:
83309.32
Organism:
Homo sapiens (Human)
Description:
ChEMBL_11231
Residue:
732
  
Inhibitor
Name:
BDBM50062849
Synonyms:
2,2-Dimethyl-3-(3,7,12-trimethyl-octadeca-3,7,11,15,17-pentaenyl)-oxirane | CHEMBL152597
Type:
Small organic molecule
Emp. Form.:
C25H40O
Mol. Mass.:
356.5845
SMILES:
CC(CC\C=C\C=C)=CCCC=C(C)CCC=C(C)CCC1OC1(C)C
: