Target
Oxysterols receptor LXR-alpha
Ligand
BDBM50509327
Substrate
Meas. Tech.
ChEMBL_1837939 (CHEMBL4338072)
IC50
>10000±n/a nM
Citation
 Marcoux, DDuan, JJShi, QCherney, RJSrivastava, ASCornelius, LBatt, DGLiu, QBeaudoin-Bertrand, MWeigelt, CAKhandelwal, PVishwakrishnan, SSelvakumar, KKarmakar, AGupta, AKBasha, MRamlingam, SManjunath, NVanteru, SKarmakar, SMaddala, NVetrichelvan, MGupta, ARampulla, RAMathur, AYip, SLi, PWu, DRKhan, JRuzanov, MSack, JSWang, JYarde, MCvijic, MELi, SShuster, DJBorowski, VXie, JHMcIntyre, KWObermeier, MTFura, AStefanski, KCornelius, GHynes, JTino, JAMacor, JESalter-Cid, LDenton, RZhao, QCarter, PHDhar, TGM Rationally Designed, Conformationally Constrained Inverse Agonists of ROR?t-Identification of a Potent, Selective Series with Biologic-Like in Vivo Efficacy. J Med Chem 62:9931-9946 (2019)  
Target
Name:
Oxysterols receptor LXR-alpha
Synonyms:
LXRA Liver X receptor alpha Liver X receptor alpha (NR1H3) NR1H3 Nuclear orphan receptor LXR-alpha | Nuclear receptor subfamily 1 group H member 3
Type:
Enzyme Catalytic Domain
Mol. Mass.:
50403.85
Organism:
Homo sapiens (Human)
Description:
Q13133
Residue:
447
  
Inhibitor
Name:
BDBM50509327
Synonyms:
CHEMBL4464711
Type:
Small organic molecule
Emp. Form.:
C28H26F8N2O5S
Mol. Mass.:
654.569
SMILES:
[H][C@@]12CNc3cc(ccc3[C@@]1(CCN2C(=O)[C@H]1CC[C@@H](CC1)C(O)=O)S(=O)(=O)c1ccc(F)cc1)C(F)(C(F)(F)F)C(F)(F)F
: