Target
Nuclear receptor ROR-alpha
Ligand
BDBM382355
Substrate
Meas. Tech.
ChEMBL_1837937 (CHEMBL4338070)
IC50
>10000±n/a nM
Citation
 Marcoux, DDuan, JJShi, QCherney, RJSrivastava, ASCornelius, LBatt, DGLiu, QBeaudoin-Bertrand, MWeigelt, CAKhandelwal, PVishwakrishnan, SSelvakumar, KKarmakar, AGupta, AKBasha, MRamlingam, SManjunath, NVanteru, SKarmakar, SMaddala, NVetrichelvan, MGupta, ARampulla, RAMathur, AYip, SLi, PWu, DRKhan, JRuzanov, MSack, JSWang, JYarde, MCvijic, MELi, SShuster, DJBorowski, VXie, JHMcIntyre, KWObermeier, MTFura, AStefanski, KCornelius, GHynes, JTino, JAMacor, JESalter-Cid, LDenton, RZhao, QCarter, PHDhar, TGM Rationally Designed, Conformationally Constrained Inverse Agonists of ROR?t-Identification of a Potent, Selective Series with Biologic-Like in Vivo Efficacy. J Med Chem 62:9931-9946 (2019)  
Target
Name:
Nuclear receptor ROR-alpha
Synonyms:
NR1F1 Nuclear receptor subfamily 1 group F member 1 RORA RZRA | Retinoid-related orphan receptor-alpha
Type:
PROTEIN
Mol. Mass.:
58976.26
Organism:
Homo sapiens (Human)
Description:
ChEMBL_101591
Residue:
523
  
Inhibitor
Name:
BDBM382355
Synonyms:
US10273259, Example 68 | US10711020, Example 68
Type:
Small organic molecule
Emp. Form.:
C30H29F8NO5S
Mol. Mass.:
667.607
SMILES:
C[C@@]1(CC[C@@H](CC1)C(=O)N1CC[C@@]2([C@H]1CCc1cc(ccc21)C(F)(C(F)(F)F)C(F)(F)F)S(=O)(=O)c1ccc(F)cc1)C(O)=O
: