Target
D(2) dopamine receptor
Ligand
BDBM50063291
Substrate
Meas. Tech.
ChEMBL_60370 (CHEMBL672206)
Ki
3.4±n/a nM
Citation
 Wustrow, DBelliotti, TGlase, SKesten, SRJohnson, DColbry, NRubin, RBlackburn, AAkunne, HCorbin, ADavis, MDGeorgic, LWhetzel, SZoski, KHeffner, TPugsley, TWise, L Aminopyrimidines with high affinity for both serotonin and dopamine receptors. J Med Chem 41:760-71 (1998)  
Target
Name:
D(2) dopamine receptor
Synonyms:
D(2) dopamine receptor DOPAMINE D2 Long DRD2 Dopamine D2 receptor Dopamine D2 receptor (D2R) Dopamine2-like | d2
Type:
Cell-surface receptors
Mol. Mass.:
50647.10
Organism:
Homo sapiens (Human)
Description:
P14416
Residue:
443
  
Inhibitor
Name:
BDBM50063291
Synonyms:
CHEMBL78791 | Thiophene-2-carboxylic acid {4-[2-(4-phenyl-piperazin-1-yl)-ethyl]-cyclohexyl}-amide
Type:
Small organic molecule
Emp. Form.:
C23H31N3OS
Mol. Mass.:
397.577
SMILES:
O=C(N[C@H]1CC[C@H](CCN2CCN(CC2)c2ccccc2)CC1)c1cccs1
: