Target
D(3) dopamine receptor
Ligand
BDBM50063292
Substrate
Meas. Tech.
ChEMBL_62432 (CHEMBL674835)
Ki
0.02±n/a nM
Citation
 Wustrow, DBelliotti, TGlase, SKesten, SRJohnson, DColbry, NRubin, RBlackburn, AAkunne, HCorbin, ADavis, MDGeorgic, LWhetzel, SZoski, KHeffner, TPugsley, TWise, L Aminopyrimidines with high affinity for both serotonin and dopamine receptors. J Med Chem 41:760-71 (1998)  
Target
Name:
D(3) dopamine receptor
Synonyms:
DOPAMINE D3 DRD3_HUMAN Dopamine D3 receptor (D3) Dopamine receptor Dopamine receptor D3
Type:
Mol. Mass.:
44243.43
Organism:
Homo sapiens (Human)
Description:
Residue:
400
  
Inhibitor
Name:
BDBM50063292
Synonyms:
CHEMBL349426 | {4-[2-(4-Phenyl-piperazin-1-yl)-ethyl]-cyclohexyl}-quinazolin-4-yl-amine
Type:
Small organic molecule
Emp. Form.:
C26H33N5
Mol. Mass.:
415.5737
SMILES:
C(CN1CCN(CC1)c1ccccc1)[C@H]1CC[C@@H](CC1)Nc1ncnc2ccccc12
: