Target
TYR_PHOSPHATASE_2 domain-containing protein
Ligand
BDBM50509490
Substrate
Meas. Tech.
ChEMBL_1838490 (CHEMBL4338623)
Ki
5200±n/a nM
Citation
 Liu, ZWang, QLi, SCui, HSun, ZChen, DLu, YLiu, HZhang, W Polypropionate Derivatives with  J Nat Prod 82:3440-3449 (2019)  
Target
Name:
TYR_PHOSPHATASE_2 domain-containing protein
Synonyms:
(PROTEIN-TYROSINE-PHOSPHATASE) (PTPase) PHOSPHOTYROSINE PROTEIN PHOSPHATASE PTPB Phosphotyrosine-protein phosphatase PTPB | Protein Tyrosine Phosphatase PTPB
Type:
Hydrolase
Mol. Mass.:
30152.45
Organism:
Mycobacterium tuberculosis
Description:
Residue:
276
  
Inhibitor
Name:
BDBM50509490
Synonyms:
CHEMBL4467104
Type:
Small organic molecule
Emp. Form.:
C26H40O6
Mol. Mass.:
448.5922
SMILES:
CC[C@H](COC(C)=O)C[C@H](C)C[C@H](C)C[C@@H](C)\C=C(/C)\C=C(\C=C\C=C\C(O)=O)/C(O)=O
: