Target
Neprilysin
Ligand
BDBM50509652
Substrate
Meas. Tech.
ChEMBL_1839011 (CHEMBL4339144)
IC50
1.6±n/a nM
Citation
 Kawanami, TKarki, RGCody, ELiu, QLiang, GKsander, GMRigel, DFSchiering, NGong, YCoppola, GMIwaki, YSun, RNeubert, AFan, LIngles, SD'Arcy, AVillard, FRamage, PJeng, AYLeung-Chu, JLiu, JBeil, MFu, FChen, WCumin, FWiesmann, CMogi, M Structure-Guided Design of Substituted Biphenyl Butanoic Acid Derivatives as Neprilysin Inhibitors. ACS Med Chem Lett 11:188-194 (2020)  
Target
Name:
Neprilysin
Synonyms:
Atriopeptidase CD_antigen=CD10 EPN MME NEP_HUMAN Neutral endopeptidase | Neutral endopeptidase 24.11
Type:
Enzyme
Mol. Mass.:
85505.38
Organism:
Homo sapiens (Human)
Description:
P08473
Residue:
750
  
Inhibitor
Name:
BDBM50509652
Synonyms:
CHEMBL4557208
Type:
Small organic molecule
Emp. Form.:
C21H23NO5
Mol. Mass.:
369.411
SMILES:
Cc1cccc(c1)-c1ccc(C[C@H](CC(O)=O)NC(=O)CCC(O)=O)cc1
: