Target
Neprilysin
Ligand
BDBM50509659
Substrate
Meas. Tech.
ChEMBL_1839011 (CHEMBL4339144)
IC50
0.800000±n/a nM
Citation
 Kawanami, TKarki, RGCody, ELiu, QLiang, GKsander, GMRigel, DFSchiering, NGong, YCoppola, GMIwaki, YSun, RNeubert, AFan, LIngles, SD'Arcy, AVillard, FRamage, PJeng, AYLeung-Chu, JLiu, JBeil, MFu, FChen, WCumin, FWiesmann, CMogi, M Structure-Guided Design of Substituted Biphenyl Butanoic Acid Derivatives as Neprilysin Inhibitors. ACS Med Chem Lett 11:188-194 (2020)  
Target
Name:
Neprilysin
Synonyms:
Atriopeptidase CD_antigen=CD10 EPN MME NEP_HUMAN Neutral endopeptidase | Neutral endopeptidase 24.11
Type:
Enzyme
Mol. Mass.:
85505.38
Organism:
Homo sapiens (Human)
Description:
P08473
Residue:
750
  
Inhibitor
Name:
BDBM50509659
Synonyms:
CHEMBL4443138
Type:
Small organic molecule
Emp. Form.:
C22H24ClNO5
Mol. Mass.:
417.883
SMILES:
CC(C[C@@H](Cc1ccc(cc1)-c1cccc(Cl)c1)NC(=O)CCC(O)=O)C(O)=O
: