Target
Nuclear receptor ROR-gamma
Ligand
BDBM50510346
Substrate
Meas. Tech.
ChEMBL_1841426 (CHEMBL4341725)
IC50
121±n/a nM
Citation
 Tanis, VMVenkatesan, HCummings, MDAlbers, MKent Barbay, JHerman, KKummer, DAMilligan, CNelen, MINishimura, RSchlueter, TScott, BSpurlino, JWolin, RWoods, CXue, XEdwards, JPFourie, AMLeonard, K 3-Substituted Quinolines as ROR?t Inverse Agonists. Bioorg Med Chem Lett 29:1463-1470 (2019)  
Target
Name:
Nuclear receptor ROR-gamma
Synonyms:
NR1F3 Nuclear receptor ROR-gamma (RORC) RAR-related orphan receptor C (RORc) RORG RZRG Retinoid-related orphan receptor-gamma (RORc)
Type:
Enzyme Catalytic Domain
Mol. Mass.:
58218.40
Organism:
Homo sapiens (Human)
Description:
P51449
Residue:
518
  
Inhibitor
Name:
BDBM50510346
Synonyms:
CHEMBL4575356
Type:
Small organic molecule
Emp. Form.:
C28H32ClF3N6O2
Mol. Mass.:
577.041
SMILES:
COc1nc2ccc(cc2c(Cl)c1CN1CCC(CC1)C(F)(F)F)C(O)(c1cnc(C)n1C)c1cnc(C)n1C
: