Target
Nuclear receptor ROR-gamma
Ligand
BDBM50510358
Substrate
Meas. Tech.
ChEMBL_1841432 (CHEMBL4341731)
IC50
313±n/a nM
Citation
 Tanis, VMVenkatesan, HCummings, MDAlbers, MKent Barbay, JHerman, KKummer, DAMilligan, CNelen, MINishimura, RSchlueter, TScott, BSpurlino, JWolin, RWoods, CXue, XEdwards, JPFourie, AMLeonard, K 3-Substituted Quinolines as ROR?t Inverse Agonists. Bioorg Med Chem Lett 29:1463-1470 (2019)  
Target
Name:
Nuclear receptor ROR-gamma
Synonyms:
NR1F3 Nuclear receptor ROR-gamma (RORC) RAR-related orphan receptor C (RORc) RORG RZRG Retinoid-related orphan receptor-gamma (RORc)
Type:
Enzyme Catalytic Domain
Mol. Mass.:
58218.40
Organism:
Homo sapiens (Human)
Description:
P51449
Residue:
518
  
Inhibitor
Name:
BDBM50510358
Synonyms:
CHEMBL4459199
Type:
Small organic molecule
Emp. Form.:
C28H33ClF3N5O3
Mol. Mass.:
580.042
SMILES:
COc1nc2ccc(cc2c(Cl)c1CN1CCC(CC1)C(F)(F)F)C(O)(C1CN(C1)C(C)=O)c1cnc(C)n1C
: