Target
Nuclear receptor ROR-gamma
Ligand
BDBM220190
Substrate
Meas. Tech.
ChEMBL_1841441 (CHEMBL4341740)
IC50
95±n/a nM
Citation
 Tanis, VMVenkatesan, HCummings, MDAlbers, MKent Barbay, JHerman, KKummer, DAMilligan, CNelen, MINishimura, RSchlueter, TScott, BSpurlino, JWolin, RWoods, CXue, XEdwards, JPFourie, AMLeonard, K 3-Substituted Quinolines as ROR?t Inverse Agonists. Bioorg Med Chem Lett 29:1463-1470 (2019)  
Target
Name:
Nuclear receptor ROR-gamma
Synonyms:
NR1F3 Nuclear receptor ROR-gamma (RORC) RAR-related orphan receptor C (RORc) RORG RZRG Retinoid-related orphan receptor-gamma (RORc)
Type:
Enzyme Catalytic Domain
Mol. Mass.:
58218.40
Organism:
Homo sapiens (Human)
Description:
P51449
Residue:
518
  
Inhibitor
Name:
BDBM220190
Synonyms:
US9290476, 33A US9290476, 33C
Type:
Small organic molecule
Emp. Form.:
C31H25Cl2N5O2
Mol. Mass.:
570.469
SMILES:
COc1nc2ccc(cc2c(Cl)c1Cc1ccc(cc1)-n1cccn1)C(O)(c1cncn1C)c1ccc(Cl)cc1
: