Target
MAP kinase-interacting serine/threonine-protein kinase 1
Ligand
BDBM50510435
Substrate
Meas. Tech.
ChEMBL_1841473 (CHEMBL4341772)
IC50
1390±n/a nM
Citation
 Zhang, MJiang, LTao, JPan, ZHe, MSu, DHe, GJiang, Q Design, synthesis and biological evaluation of 4-aniline-thieno[2,3-d]pyrimidine derivatives as MNK1 inhibitors against renal cell carcinoma and nasopharyngeal carcinoma. Bioorg Med Chem 27:2268-2279 (2019)  
Target
Name:
MAP kinase-interacting serine/threonine-protein kinase 1
Synonyms:
MAP Kinase-Interacting Protein Kinase (MNK1) MAP kinase-interacting serine/threonine-protein kinase 1 (MnK1) MAP-kinase interacting kinase 1 (MNK1) MKNK1 MNK1
Type:
Serine/threonine-protein kinase
Mol. Mass.:
51342.85
Organism:
Homo sapiens (Human)
Description:
Q9BUB5
Residue:
465
  
Inhibitor
Name:
BDBM50510435
Synonyms:
CHEMBL4446384
Type:
Small organic molecule
Emp. Form.:
C22H19FN4O3S2
Mol. Mass.:
470.54
SMILES:
COc1ccc(cc1)S(=O)(=O)N1CCc2c(C1)sc1ncnc(Nc3cccc(F)c3)c21
: