Target
Mu-type opioid receptor
Ligand
BDBM50064518
Substrate
Meas. Tech.
ChEMBL_145428 (CHEMBL748773)
Ki
0.026000±n/a nM
Citation
 Thomas, JBMascarella, SWRothman, RBPartilla, JSXu, HMcCullough, KBDersch, CMCantrell, BEZimmerman, DMCarroll, FI Investigation of the N-substituent conformation governing potency and mu receptor subtype-selectivity in (+)-(3R, 4R)-dimethyl-4-(3-hydroxyphenyl)piperidine opioid antagonists. J Med Chem 41:1980-90 (1998)  
Target
Name:
Mu-type opioid receptor
Synonyms:
M-OR-1 Mu opioid receptor OPIATE Mu OPRM_CAVPO
Type:
Enzyme Catalytic Domain
Mol. Mass.:
11165.58
Organism:
GUINEA PIG
Description:
P97266
Residue:
98
  
Inhibitor
Name:
BDBM50064518
Synonyms:
3-{(3R,4R)-1-[(E)-3-(2-Chloro-phenyl)-allyl]-3,4-dimethyl-piperidin-4-yl}-phenol CHEMBL50594 | RTI-5989-23
Type:
Small organic molecule
Emp. Form.:
C22H26ClNO
Mol. Mass.:
355.901
SMILES:
C[C@H]1CN(C\C=C\c2ccccc2Cl)CC[C@@]1(C)c1cccc(O)c1
: