Target
Bile acid receptor
Ligand
BDBM50510492
Substrate
Meas. Tech.
ChEMBL_1841526 (CHEMBL4341825)
IC50
1500±n/a nM
Citation
 Teno, NYamashita, YMasuda, AIguchi, YOda, KFujimori, KHiramoto, TNishimaki-Mogami, TUne, MGohda, K Identification of potent farnesoid X receptor (FXR) antagonist showing favorable PK profile and distribution toward target tissues: Comprehensive understanding of structure-activity relationship of FXR antagonists. Bioorg Med Chem 27:2220-2227 (2019)  
Target
Name:
Bile acid receptor
Synonyms:
BAR FXR HRR1 NR1H4_HUMAN RIP14 Retinoid X receptor-interacting protein 14 | farnesoid x receptor
Type:
Nuclear Receptor
Mol. Mass.:
55916.24
Organism:
Homo sapiens (Human)
Description:
Q96RI1
Residue:
486
  
Inhibitor
Name:
BDBM50510492
Synonyms:
CHEMBL4472554
Type:
Small organic molecule
Emp. Form.:
C35H40N6O4
Mol. Mass.:
608.7299
SMILES:
CC(C)NC(=O)N1CCC(C[C@H](N2C(=O)CN(C2=O)c2ccc(Oc3ccccc3)cc2)c2nc3ccc(C)cc3n2C)CC1
: