Target
Bile acid receptor
Ligand
BDBM50510488
Substrate
Meas. Tech.
ChEMBL_1841527 (CHEMBL4341826)
IC50
2.4±n/a nM
Citation
 Teno, NYamashita, YMasuda, AIguchi, YOda, KFujimori, KHiramoto, TNishimaki-Mogami, TUne, MGohda, K Identification of potent farnesoid X receptor (FXR) antagonist showing favorable PK profile and distribution toward target tissues: Comprehensive understanding of structure-activity relationship of FXR antagonists. Bioorg Med Chem 27:2220-2227 (2019)  
Target
Name:
Bile acid receptor
Synonyms:
BAR FXR HRR1 NR1H4_HUMAN RIP14 Retinoid X receptor-interacting protein 14 | farnesoid x receptor
Type:
Nuclear Receptor
Mol. Mass.:
55916.24
Organism:
Homo sapiens (Human)
Description:
Q96RI1
Residue:
486
  
Inhibitor
Name:
BDBM50510488
Synonyms:
CHEMBL4519419
Type:
Small organic molecule
Emp. Form.:
C38H45N5O4
Mol. Mass.:
635.795
SMILES:
CC(C)Cn1c(nc2ccc(C)cc12)[C@H](CC1CCN(CC1)C(=O)C(C)C)N1C(=O)CN(C1=O)c1ccc(Oc2ccccc2)cc1
: