Target
D(2) dopamine receptor
Ligand
BDBM50064784
Substrate
Meas. Tech.
ChEMBL_60372 (CHEMBL672208)
Ki
325±n/a nM
Citation
 Ennis, MDGhazal, NBHoffman, RLSmith, MWSchlachter, SKLawson, CFIm, WBPregenzer, JFSvensson, KALewis, RAHall, EDSutter, DMHarris, LTMcCall, RB Isochroman-6-carboxamides as highly selective 5-HT1D agonists: potential new treatment for migraine without cardiovascular side effects. J Med Chem 41:2180-3 (1998)  
Target
Name:
D(2) dopamine receptor
Synonyms:
D(2) dopamine receptor DOPAMINE D2 Long DRD2 Dopamine D2 receptor Dopamine D2 receptor (D2R) Dopamine2-like | d2
Type:
Cell-surface receptors
Mol. Mass.:
50647.10
Organism:
Homo sapiens (Human)
Description:
P14416
Residue:
443
  
Inhibitor
Name:
BDBM50064784
Synonyms:
(S)-1-{2-[4-(4-Methoxy-phenyl)-piperazin-1-yl]-ethyl}-isochroman-6-carboxylic acid amide | CHEMBL71635
Type:
Small organic molecule
Emp. Form.:
C23H29N3O3
Mol. Mass.:
395.4947
SMILES:
COc1ccc(cc1)N1CCN(CC[C@@H]2OCCc3cc(ccc23)C(N)=O)CC1
: