Target
5-hydroxytryptamine receptor 1D
Ligand
BDBM50064784
Substrate
Meas. Tech.
ChEMBL_1650 (CHEMBL616742)
Ki
3.8±n/a nM
Citation
 Ennis, MDGhazal, NBHoffman, RLSmith, MWSchlachter, SKLawson, CFIm, WBPregenzer, JFSvensson, KALewis, RAHall, EDSutter, DMHarris, LTMcCall, RB Isochroman-6-carboxamides as highly selective 5-HT1D agonists: potential new treatment for migraine without cardiovascular side effects. J Med Chem 41:2180-3 (1998)  
Target
Name:
5-hydroxytryptamine receptor 1D
Synonyms:
5-HT-1D 5-HT1D 5HT1D_HUMAN HTR1DA Serotonin (5-HT) receptor | Serotonin Receptor 1D
Type:
G Protein-Coupled Receptor (GPCR)
Mol. Mass.:
41920.63
Organism:
Homo sapiens (Human)
Description:
Receptor binding assays were performed using human clone stably expressed in CHO cells.
Residue:
377
  
Inhibitor
Name:
BDBM50064784
Synonyms:
(S)-1-{2-[4-(4-Methoxy-phenyl)-piperazin-1-yl]-ethyl}-isochroman-6-carboxylic acid amide | CHEMBL71635
Type:
Small organic molecule
Emp. Form.:
C23H29N3O3
Mol. Mass.:
395.4947
SMILES:
COc1ccc(cc1)N1CCN(CC[C@@H]2OCCc3cc(ccc23)C(N)=O)CC1
: