Target
Platelet-derived growth factor receptor beta
Ligand
BDBM88120
Substrate
Meas. Tech.
ChEMBL_1842514 (CHEMBL4342941)
Kd
14±n/a nM
Target
Name:
Platelet-derived growth factor receptor beta
Synonyms:
Beta-type platelet-derived growth factor receptor CD140b antigen PDGF Receptor Substrate PDGFR PDGFR-1 PDGFRB PGFRB_HUMAN Platelet-derived growth factor receptor 1 Platelet-derived growth factor receptor beta (PDGFR-beta) Platelet-derived growth factor receptor beta (PDGFRbeta) | VHL/PDGFRB
Type:
Enzyme
Mol. Mass.:
123922.25
Organism:
Homo sapiens (Human)
Description:
P09619
Residue:
1106
  
Inhibitor
Name:
BDBM88120
Synonyms:
US10245267, Example 1156 US9694016, 1156
Type:
Small organic molecule
Emp. Form.:
C25H25F3N4O4
Mol. Mass.:
502.4856
SMILES:
Cc1ccc(NC(=O)c2ccnc(c2)C(F)(F)F)cc1-c1cc(OCCO)nc(c1)N1CCOCC1
: