Target
G-protein coupled receptor 84
Ligand
BDBM50511025
Substrate
Meas. Tech.
ChEMBL_1843332 (CHEMBL4343759)
Ki
2.6±n/a nM
Citation
 Köse, MPillaiyar, TNamasivayam, VDe Filippo, ESylvester, KUlven, Tvon Kügelgen, IMüller, CE An Agonist Radioligand for the Proinflammatory Lipid-Activated G Protein-Coupled Receptor GPR84 Providing Structural Insights. J Med Chem 63:2391-2410 (2020)  
Target
Name:
G-protein coupled receptor 84
Synonyms:
EX33 GPR84 Inflammation-related G-protein coupled receptor EX33
Type:
PROTEIN
Mol. Mass.:
43726.73
Organism:
Homo sapiens (Human)
Description:
ChEMBL_116040
Residue:
396
  
Inhibitor
Name:
BDBM50511025
Synonyms:
CHEMBL4438595
Type:
Small organic molecule
Emp. Form.:
C12H11ClN2O2S
Mol. Mass.:
282.746
SMILES:
Oc1cc(=O)[nH]c(SCCc2ccc(Cl)cc2)n1
: