Target
Phosphatidylinositol 5-phosphate 4-kinase type-2 beta
Ligand
BDBM50511418
Substrate
Meas. Tech.
ChEMBL_1844802 (CHEMBL4345229)
IC50
8900±n/a nM
Citation
 Manz, TDSivakumaren, SCYasgar, AHall, MDDavis, MISeo, HSCard, JDFicarro, SBShim, HMarto, JADhe-Paganon, SSasaki, ATBoxer, MBSimeonov, ACantley, LCShen, MZhang, TFerguson, FMGray, NS Structure-Activity Relationship Study of Covalent Pan-phosphatidylinositol 5-Phosphate 4-Kinase Inhibitors. ACS Med Chem Lett 11:346-352 (2020)  
Target
Name:
Phosphatidylinositol 5-phosphate 4-kinase type-2 beta
Synonyms:
PI42B_HUMAN PIP5K2B | Phosphatidylinositol-5-phosphate 4-kinase type-2 beta
Type:
PROTEIN
Mol. Mass.:
47382.97
Organism:
Homo sapiens (Human)
Description:
ChEMBL_774395
Residue:
416
  
Inhibitor
Name:
BDBM50511418
Synonyms:
CHEMBL4533123
Type:
Small organic molecule
Emp. Form.:
C30H28N8O2
Mol. Mass.:
532.5957
SMILES:
CN(C)C\C=C\C(=O)Nc1cccc(c1)C(=O)Nc1cccc(Nc2cc(ncn2)-c2cnc3[nH]ccc3c2)c1
: