Target
1-phosphatidylinositol 3-phosphate 5-kinase
Ligand
BDBM50511422
Substrate
Meas. Tech.
ChEMBL_1844812 (CHEMBL4345239)
IC50
40±n/a nM
Citation
 Manz, TDSivakumaren, SCYasgar, AHall, MDDavis, MISeo, HSCard, JDFicarro, SBShim, HMarto, JADhe-Paganon, SSasaki, ATBoxer, MBSimeonov, ACantley, LCShen, MZhang, TFerguson, FMGray, NS Structure-Activity Relationship Study of Covalent Pan-phosphatidylinositol 5-Phosphate 4-Kinase Inhibitors. ACS Med Chem Lett 11:346-352 (2020)  
Target
Name:
1-phosphatidylinositol 3-phosphate 5-kinase
Synonyms:
1-phosphatidylinositol 3-phosphate 5-kinase 2.7.11.1 FYVE finger-containing phosphoinositide kinase PIKFYVE PIPkin-III Phosphatidylinositol 3-phosphate 5-kinase type III Type III PIP kinase
Type:
PROTEIN
Mol. Mass.:
237139.57
Organism:
Homo sapiens
Description:
ChEMBL_104433
Residue:
2098
  
Inhibitor
Name:
BDBM50511422
Synonyms:
CHEMBL4446338
Type:
Small organic molecule
Emp. Form.:
C31H29N7O2
Mol. Mass.:
531.6077
SMILES:
CN(C)C\C=C\C(=O)Nc1ccc(cc1)C(=O)Nc1cccc(Nc2cc(ncn2)-c2c[nH]c3ccccc23)c1
: