Target
D(2) dopamine receptor
Ligand
BDBM50511513
Substrate
Meas. Tech.
ChEMBL_1844901 (CHEMBL4345328)
EC50
0.316228±n/a nM
Citation
 Park, HUrs, ANZimmerman, JLiu, CWang, QUrs, NM Structure-Functional-Selectivity Relationship Studies of Novel Apomorphine Analogs to Develop D1R/D2R Biased Ligands. ACS Med Chem Lett 11:385-392 (2020)  
Target
Name:
D(2) dopamine receptor
Synonyms:
D(2) dopamine receptor DOPAMINE D2 Long DRD2 Dopamine D2 receptor Dopamine D2 receptor (D2R) Dopamine2-like | d2
Type:
Cell-surface receptors
Mol. Mass.:
50647.10
Organism:
Homo sapiens (Human)
Description:
P14416
Residue:
443
  
Inhibitor
Name:
BDBM50511513
Synonyms:
CHEMBL4591021
Type:
Small organic molecule
Emp. Form.:
C21H25NO4
Mol. Mass.:
355.4275
SMILES:
[H][C@]12Cc3ccc(OCOC)c(OCOC)c3-c3cccc(CCN1C)c23
: