Target
Cyclin-dependent kinase 2
Ligand
BDBM154576
Substrate
Meas. Tech.
ChEMBL_1846280 (CHEMBL4346821)
Kd
53±n/a nM
Citation
 Tadesse, SCaldon, ECTilley, WWang, S Cyclin-Dependent Kinase 2 Inhibitors in Cancer Therapy: An Update. J Med Chem 62:4233-4251 (2019)  
Target
Name:
Cyclin-dependent kinase 2
Synonyms:
CDK2 CDK2_HUMAN Cell division protein kinase 2 Protein cereblon/Cyclin-dependent kinase 2 | p33 protein kinase
Type:
Enzyme Subunit
Mol. Mass.:
33938.17
Organism:
Homo sapiens (Human)
Description:
P24941
Residue:
298
  
Inhibitor
Name:
BDBM154576
Synonyms:
K03861 (1)
Type:
Small organic molecule
Emp. Form.:
C24H26F3N7O2
Mol. Mass.:
501.5041
SMILES:
CN1CCN(Cc2ccc(NC(=O)Nc3ccc(Oc4ccnc(N)n4)cc3)cc2C(F)(F)F)CC1
: