Target
Gamma-aminobutyric acid receptor subunit alpha-1/beta-3/gamma-2
Ligand
BDBM144227
Substrate
Meas. Tech.
ChEMBL_1850883 (CHEMBL4351507)
Ki
0.180000±n/a nM
Citation
 Owen, RMBlakemore, DCao, LFlanagan, NFish, RGibson, KRGurrell, RHuh, CWKammonen, JMortimer-Cassen, ENickolls, SAOmoto, KOwen, DPike, APryde, DCReynolds, DSRoeloffs, RRose, CStead, CTakeuchi, MWarmus, JSWatson, C Design and Identification of a Novel, Functionally Subtype Selective GABA J Med Chem 62:5773-5796 (2019)  
Target
Name:
Gamma-aminobutyric acid receptor subunit alpha-1/beta-3/gamma-2
Synonyms:
GABA receptor alpha-1/beta-3/gamma-2 subunit GABAA alpha1beta3gamma2
Type:
Protein
Mol. Mass.:
Description:
Components:
This complex has 3 components.
Component 1
Name:
Gamma-aminobutyric acid receptor subunit alpha-1
Synonyms:
Benzodiazepine central GABA A Benzodiazepine liver GABA(A) receptor subunit alpha-1 GABA-A receptor GBRA1_HUMAN TBPS | agonist GABA site
Type:
Protein
Mol. Mass.:
51817.35
Organism:
Homo sapiens (Human)
Description:
P14867
Residue:
456
  
Component 2
Name:
Gamma-aminobutyric acid receptor subunit beta-3
Synonyms:
GABA A receptor alpha-4/beta-3/gamma-2 GABA-A receptor GBRB3_HUMAN | agonist GABA site
Type:
PROTEIN
Mol. Mass.:
54130.51
Organism:
Homo sapiens (Human)
Description:
ChEMBL_448071
Residue:
473
  
Component 3
Name:
Gamma-aminobutyric acid receptor subunit gamma-2
Synonyms:
GABA(A) receptor subunit gamma-2 GBRG2_HUMAN
Type:
PROTEIN
Mol. Mass.:
54172.74
Organism:
Homo sapiens (Human)
Description:
EBI_217
Residue:
467
  
Inhibitor
Name:
BDBM144227
Synonyms:
US8952008, 4
Type:
Small organic molecule
Emp. Form.:
C22H21FN4O3S
Mol. Mass.:
440.491
SMILES:
CCn1cnc2c(cnnc12)-c1ccc(F)c(c1)-c1ccc(cc1OC)S(=O)(=O)CC
: