Target
Capsid protein
Ligand
BDBM50366817
Substrate
Meas. Tech.
ChEMBL_1852275 (CHEMBL4352899)
IC50
<100±n/a nM
Citation
 Qiu, JChen, WZhang, YZhou, QChen, JYang, LGao, JGu, XTang, D Assessment of quinazolinone derivatives as novel non-nucleoside hepatitis B virus inhibitors. Eur J Med Chem 176:41-49 (2019)  
Target
Name:
Capsid protein
Synonyms:
Core antigen
Type:
PROTEIN
Mol. Mass.:
26278.39
Organism:
Hepatitis B virus
Description:
ChEMBL_450484
Residue:
230
  
Inhibitor
Name:
BDBM50366817
Synonyms:
Epivir
Type:
Small organic molecule
Emp. Form.:
C8H11N3O3S
Mol. Mass.:
229.256
SMILES:
Nc1ccn([C@@H]2CS[C@H](CO)O2)c(=O)n1
: