Target
Carbonic anhydrase 9
Ligand
BDBM50513289
Substrate
Meas. Tech.
ChEMBL_1852932 (CHEMBL4353556)
Ki
12±n/a nM
Citation
 Angeli, ADi Cesare Mannelli, LGhelardini, CPeat, TSBartolucci, GMenicatti, MCarta, FSupuran, CT Benzensulfonamides bearing spyrohydantoin moieties act as potent inhibitors of human carbonic anhydrases II and VII and show neuropathic pain attenuating effects. Eur J Med Chem 177:188-197 (2019)  
Target
Name:
Carbonic anhydrase 9
Synonyms:
CA-IX CAH9_HUMAN Carbonic anhydrase 9 (CA IX) Carbonic anhydrase 9 precursor Carbonic anhydrase IX (CAIX) Carbonic anhydrases; II & IX MN RCC-associated antigen G250
Type:
Enzyme
Mol. Mass.:
49669.03
Organism:
Homo sapiens (Human)
Description:
Catalytic domain of human cloned isozyme was used in the assay
Residue:
459
  
Inhibitor
Name:
BDBM50513289
Synonyms:
CHEMBL4435918
Type:
Small organic molecule
Emp. Form.:
C15H18N4O5S
Mol. Mass.:
366.392
SMILES:
NS(=O)(=O)c1ccc(NC(=O)CN2C(=O)NC3(CCCC3)C2=O)cc1
: