Target
Carbonic anhydrase 9
Ligand
BDBM50513287
Substrate
Meas. Tech.
ChEMBL_1852932 (CHEMBL4353556)
Ki
6.4±n/a nM
Citation
 Angeli, ADi Cesare Mannelli, LGhelardini, CPeat, TSBartolucci, GMenicatti, MCarta, FSupuran, CT Benzensulfonamides bearing spyrohydantoin moieties act as potent inhibitors of human carbonic anhydrases II and VII and show neuropathic pain attenuating effects. Eur J Med Chem 177:188-197 (2019)  
Target
Name:
Carbonic anhydrase 9
Synonyms:
CA-IX CAH9_HUMAN Carbonic anhydrase 9 (CA IX) Carbonic anhydrase 9 precursor Carbonic anhydrase IX (CAIX) Carbonic anhydrases; II & IX MN RCC-associated antigen G250
Type:
Enzyme
Mol. Mass.:
49669.03
Organism:
Homo sapiens (Human)
Description:
Catalytic domain of human cloned isozyme was used in the assay
Residue:
459
  
Inhibitor
Name:
BDBM50513287
Synonyms:
CHEMBL4464229
Type:
Small organic molecule
Emp. Form.:
C24H28N4O5SSe
Mol. Mass.:
563.53
SMILES:
[#7]S(=O)(=O)c1ccc(-[#6][Se;v2]c2ccc(-[#7]-[#6](=O)-[#6]-[#7]-3-[#6](=O)-[#7]C4([#6]-[#6]-[#6]-[#6]-[#6]-[#6]4)[#6]-3=O)cc2)cc1
: