Target
Carbonic anhydrase 2
Ligand
BDBM50513285
Substrate
Meas. Tech.
ChEMBL_1852924 (CHEMBL4353548)
Ki
0.710000±n/a nM
Citation
 Angeli, ADi Cesare Mannelli, LGhelardini, CPeat, TSBartolucci, GMenicatti, MCarta, FSupuran, CT Benzensulfonamides bearing spyrohydantoin moieties act as potent inhibitors of human carbonic anhydrases II and VII and show neuropathic pain attenuating effects. Eur J Med Chem 177:188-197 (2019)  
Target
Name:
Carbonic anhydrase 2
Synonyms:
CA-II CAC Carbonate dehydratase II Carbonic anhydrase 2 (CA-II) Carbonic anhydrase C Carbonic anhydrase II (CA-II) Carbonic anhydrase II (hCA II) | Carbonic anhydrase isoenzyme II (hCA II)
Type:
Enzyme
Mol. Mass.:
29250.71
Organism:
Homo sapiens (Human)
Description:
P00918
Residue:
260
  
Inhibitor
Name:
BDBM50513285
Synonyms:
CHEMBL4553772
Type:
Small organic molecule
Emp. Form.:
C19H26N4O5S
Mol. Mass.:
422.499
SMILES:
NS(=O)(=O)c1ccc(CCNC(=O)CN2C(=O)NC3(CCCCCC3)C2=O)cc1
: