Target
5-hydroxytryptamine receptor 2B
Ligand
BDBM50068612
Substrate
Meas. Tech.
ChEMBL_2863 (CHEMBL617504)
Ki
0.19±n/a nM
Citation
 Parker, MAMarona-Lewicka, DLucaites, VLNelson, DLNichols, DE A novel (benzodifuranyl)aminoalkane with extremely potent activity at the 5-HT2A receptor. J Med Chem 41:5148-9 (1999)  
Target
Name:
5-hydroxytryptamine receptor 2B
Synonyms:
5-HT-2B 5-hydroxytryptamine (serotonin) receptor 2B [Homo sapiens] 5-hydroxytryptamine receptor 2C (5HT2C) HTR2B Serotonin 2b (5-HT2b) receptor | Serotonin Receptor 2B
Type:
G Protein-Coupled Receptor (GPCR)
Mol. Mass.:
54312.47
Organism:
Homo sapiens (Human)
Description:
Receptor binding assays were performed using human clone stably expressed in CHO cells.
Residue:
481
  
Inhibitor
Name:
BDBM50068612
Synonyms:
2-(8-Bromo-benzo[1,2-b;4,5-b']difuran-4-yl)-1-methyl-ethylamine | CHEMBL149024
Type:
Small organic molecule
Emp. Form.:
C13H12BrNO2
Mol. Mass.:
294.144
SMILES:
CC(N)Cc1c2ccoc2c(Br)c2ccoc12
: