Target
Lysine-specific demethylase 4A
Ligand
BDBM50513361
Substrate
Meas. Tech.
ChEMBL_1853106 (CHEMBL4353730)
Ki
3.0±n/a nM
Citation
 Le Bihan, YVLanigan, RMAtrash, BMcLaughlin, MGVelupillai, SMalcolm, AGEngland, KSRuda, GFMok, NYTumber, ATomlin, KSaville, HShehu, EMcAndrew, CCarmichael, LBennett, JMJeganathan, FEve, PDonovan, AHayes, AWood, FRaynaud, FIFedorov, OBrennan, PEBurke, Rvan Montfort, RLMRossanese, OWBlagg, JBavetsias, V C8-substituted pyrido[3,4-d]pyrimidin-4(3H)-ones: Studies towards the identification of potent, cell penetrant Jumonji C domain containing histone lysine demethylase 4 subfamily (KDM4) inhibitors, compound profiling in cell-based target engagement assays. Eur J Med Chem 177:316-337 (2019)  
Target
Name:
Lysine-specific demethylase 4A
Synonyms:
JHDM3A JMJD2A Jumonji domain-containing protein 2A KDM4A_HUMAN Lysine-specific demethylase 4A | Lysine-specific demethylase 4A (KDM4A)
Type:
Enzyme
Mol. Mass.:
120647.83
Organism:
Homo sapiens (Human)
Description:
O75164
Residue:
1064
  
Inhibitor
Name:
BDBM50513361
Synonyms:
CHEMBL4567766
Type:
Small organic molecule
Emp. Form.:
C28H27N7O
Mol. Mass.:
477.5603
SMILES:
O=c1[nH]cnc2c(nccc12)-n1cc(CCN2CCC(CC2)c2cccc(c2)-c2cccnc2)cn1
: